GG2 Institutionalize a Managed Process
type: Class
comment: ∃ achievedBy GP2.2_Plan_the_Process ∃ achievedBy GP2.3_Provide_Resources
equivalent class: Class
  intersection of: Class
    intersection of: Class
      intersection of: Restriction
        some values from: GP2.10 Review Status with Higher Level Management
        on property: achievedBy
      intersection of: Restriction
        on property: achievedBy
        some values from: GP2.1 Establish an Organizational Policy
    intersection of: Class
      intersection of: Restriction
        some values from: GP2.2 Plan the Process
        on property: achievedBy
      intersection of: Restriction
        some values from: GP2.3 Provide Resources
        on property: achievedBy
  intersection of: Class
    intersection of: Class
      intersection of: Class
        intersection of: Restriction
      intersection of: Class
        intersection of: Restriction
    intersection of: Class
      intersection of: Restriction
        on property: achievedBy
        some values from: GP2.8 Monitor and Control the Process
      intersection of: Restriction
        some values from: GP2.9 Objectively Evaluate Adherence
        on property: achievedBy
subclass of: Generic Goal